{"text_format":"1","workbook":"xlsx","n_sheets":3,"sheets":["Ark1","Ark2","Ark3"],"not_rendered":{"charts":0,"images":1,"macros":1,"external_links":0,"defined_names":1,"comments":0,"pivot_tables":0},"unopened":[],"bounds":{"document_bytes":16777216,"sheet_cells":100000,"rows_first":2000,"rows_last":500,"rows_between":2000,"halvings":0,"cell_chars":16384,"cell_head_chars":4096},"cells_cut":0,"cells_raw":0,"read":"whole","date_system":"1900"}

{"sheet":"Ark1","index":0,"n_rows":100,"n_cols":6,"rows_kept":100,"cut":false,"hidden":false,"merged":[]}
["Vælg kommune"]
[]
[null,"",{"$f":"--ISNUMBER(IFERROR(SEARCH($B$3,F3,1),\"\"))","v":1},{"$f":"IF(C3=1,COUNTIF($C$3:C3,1),\"\")","v":1},{"$f":"IFERROR(INDEX($F$3:$F$100,MATCH(ROWS($D$3:D3),$D$3:$D$100,0)),\"\")","v":"Albertslund"},"Albertslund"]
[null,null,{"$f":"--ISNUMBER(IFERROR(SEARCH($B$3,F4,1),\"\"))","v":1},{"$f":"IF(C4=1,COUNTIF($C$3:C4,1),\"\")","v":2},{"$f":"IFERROR(INDEX($F$3:$F$100,MATCH(ROWS($D$3:D4),$D$3:$D$100,0)),\"\")","v":"Allerød"},"Allerød"]
[null,null,1,{"$f":"IF(C5=1,COUNTIF($C$3:C5,1),\"\")","v":3},{"$f":"IFERROR(INDEX($F$3:$F$100,MATCH(ROWS($D$3:D5),$D$3:$D$100,0)),\"\")","v":"Assens"},"Assens"]
[null,null,1,{"$f":"IF(C6=1,COUNTIF($C$3:C6,1),\"\")","v":4},{"$f":"IFERROR(INDEX($F$3:$F$100,MATCH(ROWS($D$3:D6),$D$3:$D$100,0)),\"\")","v":"Ballerup"},"Ballerup"]
[null,null,1,{"$f":"IF(C7=1,COUNTIF($C$3:C7,1),\"\")","v":5},{"$f":"IFERROR(INDEX($F$3:$F$100,MATCH(ROWS($D$3:D7),$D$3:$D$100,0)),\"\")","v":"Billund"},"Billund"]
[null,null,1,{"$f":"IF(C8=1,COUNTIF($C$3:C8,1),\"\")","v":6},{"$f":"IFERROR(INDEX($F$3:$F$100,MATCH(ROWS($D$3:D8),$D$3:$D$100,0)),\"\")","v":"Bornholm"},"Bornholm"]
[null,null,1,{"$f":"IF(C9=1,COUNTIF($C$3:C9,1),\"\")","v":7},{"$f":"IFERROR(INDEX($F$3:$F$100,MATCH(ROWS($D$3:D9),$D$3:$D$100,0)),\"\")","v":"Brøndby"},"Brøndby"]
[null,null,1,{"$f":"IF(C10=1,COUNTIF($C$3:C10,1),\"\")","v":8},{"$f":"IFERROR(INDEX($F$3:$F$100,MATCH(ROWS($D$3:D10),$D$3:$D$100,0)),\"\")","v":"Brønderslev"},"Brønderslev"]
[null,null,1,{"$f":"IF(C11=1,COUNTIF($C$3:C11,1),\"\")","v":9},{"$f":"IFERROR(INDEX($F$3:$F$100,MATCH(ROWS($D$3:D11),$D$3:$D$100,0)),\"\")","v":"Dragør"},"Dragør"]
[null,null,1,{"$f":"IF(C12=1,COUNTIF($C$3:C12,1),\"\")","v":10},{"$f":"IFERROR(INDEX($F$3:$F$100,MATCH(ROWS($D$3:D12),$D$3:$D$100,0)),\"\")","v":"Egedal"},"Egedal"]
[null,null,1,{"$f":"IF(C13=1,COUNTIF($C$3:C13,1),\"\")","v":11},{"$f":"IFERROR(INDEX($F$3:$F$100,MATCH(ROWS($D$3:D13),$D$3:$D$100,0)),\"\")","v":"Esbjerg"},"Esbjerg"]
[null,null,1,{"$f":"IF(C14=1,COUNTIF($C$3:C14,1),\"\")","v":12},{"$f":"IFERROR(INDEX($F$3:$F$100,MATCH(ROWS($D$3:D14),$D$3:$D$100,0)),\"\")","v":"Fanø"},"Fanø"]
[null,null,1,{"$f":"IF(C15=1,COUNTIF($C$3:C15,1),\"\")","v":13},{"$f":"IFERROR(INDEX($F$3:$F$100,MATCH(ROWS($D$3:D15),$D$3:$D$100,0)),\"\")","v":"Favrskov"},"Favrskov"]
[null,null,1,{"$f":"IF(C16=1,COUNTIF($C$3:C16,1),\"\")","v":14},{"$f":"IFERROR(INDEX($F$3:$F$100,MATCH(ROWS($D$3:D16),$D$3:$D$100,0)),\"\")","v":"Faxe"},"Faxe"]
[null,null,1,{"$f":"IF(C17=1,COUNTIF($C$3:C17,1),\"\")","v":15},{"$f":"IFERROR(INDEX($F$3:$F$100,MATCH(ROWS($D$3:D17),$D$3:$D$100,0)),\"\")","v":"Fredensborg"},"Fredensborg"]
[null,null,1,{"$f":"IF(C18=1,COUNTIF($C$3:C18,1),\"\")","v":16},{"$f":"IFERROR(INDEX($F$3:$F$100,MATCH(ROWS($D$3:D18),$D$3:$D$100,0)),\"\")","v":"Fredericia"},"Fredericia"]
[null,null,1,{"$f":"IF(C19=1,COUNTIF($C$3:C19,1),\"\")","v":17},{"$f":"IFERROR(INDEX($F$3:$F$100,MATCH(ROWS($D$3:D19),$D$3:$D$100,0)),\"\")","v":"Frederiksberg"},"Frederiksberg"]
[null,null,1,{"$f":"IF(C20=1,COUNTIF($C$3:C20,1),\"\")","v":18},{"$f":"IFERROR(INDEX($F$3:$F$100,MATCH(ROWS($D$3:D20),$D$3:$D$100,0)),\"\")","v":"Frederikshavn"},"Frederikshavn"]
[null,null,1,{"$f":"IF(C21=1,COUNTIF($C$3:C21,1),\"\")","v":19},{"$f":"IFERROR(INDEX($F$3:$F$100,MATCH(ROWS($D$3:D21),$D$3:$D$100,0)),\"\")","v":"Frederikssund"},"Frederikssund"]
[null,null,1,{"$f":"IF(C22=1,COUNTIF($C$3:C22,1),\"\")","v":20},{"$f":"IFERROR(INDEX($F$3:$F$100,MATCH(ROWS($D$3:D22),$D$3:$D$100,0)),\"\")","v":"Furesø"},"Furesø"]
[null,null,1,{"$f":"IF(C23=1,COUNTIF($C$3:C23,1),\"\")","v":21},{"$f":"IFERROR(INDEX($F$3:$F$100,MATCH(ROWS($D$3:D23),$D$3:$D$100,0)),\"\")","v":"Faaborg-Midtfyn"},"Faaborg-Midtfyn"]
[null,null,1,{"$f":"IF(C24=1,COUNTIF($C$3:C24,1),\"\")","v":22},{"$f":"IFERROR(INDEX($F$3:$F$100,MATCH(ROWS($D$3:D24),$D$3:$D$100,0)),\"\")","v":"Gentofte"},"Gentofte"]
[null,null,1,{"$f":"IF(C25=1,COUNTIF($C$3:C25,1),\"\")","v":23},{"$f":"IFERROR(INDEX($F$3:$F$100,MATCH(ROWS($D$3:D25),$D$3:$D$100,0)),\"\")","v":"Gladsaxe"},"Gladsaxe"]
[null,null,1,{"$f":"IF(C26=1,COUNTIF($C$3:C26,1),\"\")","v":24},{"$f":"IFERROR(INDEX($F$3:$F$100,MATCH(ROWS($D$3:D26),$D$3:$D$100,0)),\"\")","v":"Glostrup"},"Glostrup"]
[null,null,1,{"$f":"IF(C27=1,COUNTIF($C$3:C27,1),\"\")","v":25},{"$f":"IFERROR(INDEX($F$3:$F$100,MATCH(ROWS($D$3:D27),$D$3:$D$100,0)),\"\")","v":"Greve"},"Greve"]
[null,null,1,{"$f":"IF(C28=1,COUNTIF($C$3:C28,1),\"\")","v":26},{"$f":"IFERROR(INDEX($F$3:$F$100,MATCH(ROWS($D$3:D28),$D$3:$D$100,0)),\"\")","v":"Gribskov"},"Gribskov"]
[null,null,1,{"$f":"IF(C29=1,COUNTIF($C$3:C29,1),\"\")","v":27},{"$f":"IFERROR(INDEX($F$3:$F$100,MATCH(ROWS($D$3:D29),$D$3:$D$100,0)),\"\")","v":"Guldborgsund"},"Guldborgsund"]
[null,null,1,{"$f":"IF(C30=1,COUNTIF($C$3:C30,1),\"\")","v":28},{"$f":"IFERROR(INDEX($F$3:$F$100,MATCH(ROWS($D$3:D30),$D$3:$D$100,0)),\"\")","v":"Haderslev"},"Haderslev"]
[null,null,1,{"$f":"IF(C31=1,COUNTIF($C$3:C31,1),\"\")","v":29},{"$f":"IFERROR(INDEX($F$3:$F$100,MATCH(ROWS($D$3:D31),$D$3:$D$100,0)),\"\")","v":"Halsnæs"},"Halsnæs"]
[null,null,1,{"$f":"IF(C32=1,COUNTIF($C$3:C32,1),\"\")","v":30},{"$f":"IFERROR(INDEX($F$3:$F$100,MATCH(ROWS($D$3:D32),$D$3:$D$100,0)),\"\")","v":"Hedensted"},"Hedensted"]
[null,null,1,{"$f":"IF(C33=1,COUNTIF($C$3:C33,1),\"\")","v":31},{"$f":"IFERROR(INDEX($F$3:$F$100,MATCH(ROWS($D$3:D33),$D$3:$D$100,0)),\"\")","v":"Helsingør"},"Helsingør"]
[null,null,1,{"$f":"IF(C34=1,COUNTIF($C$3:C34,1),\"\")","v":32},{"$f":"IFERROR(INDEX($F$3:$F$100,MATCH(ROWS($D$3:D34),$D$3:$D$100,0)),\"\")","v":"Herlev"},"Herlev"]
[null,null,1,{"$f":"IF(C35=1,COUNTIF($C$3:C35,1),\"\")","v":33},{"$f":"IFERROR(INDEX($F$3:$F$100,MATCH(ROWS($D$3:D35),$D$3:$D$100,0)),\"\")","v":"Herning"},"Herning"]
[null,null,1,{"$f":"IF(C36=1,COUNTIF($C$3:C36,1),\"\")","v":34},{"$f":"IFERROR(INDEX($F$3:$F$100,MATCH(ROWS($D$3:D36),$D$3:$D$100,0)),\"\")","v":"Hillerød"},"Hillerød"]
[null,null,1,{"$f":"IF(C37=1,COUNTIF($C$3:C37,1),\"\")","v":35},{"$f":"IFERROR(INDEX($F$3:$F$100,MATCH(ROWS($D$3:D37),$D$3:$D$100,0)),\"\")","v":"Hjørring"},"Hjørring"]
[null,null,1,{"$f":"IF(C38=1,COUNTIF($C$3:C38,1),\"\")","v":36},{"$f":"IFERROR(INDEX($F$3:$F$100,MATCH(ROWS($D$3:D38),$D$3:$D$100,0)),\"\")","v":"Holbæk"},"Holbæk"]
[null,null,1,{"$f":"IF(C39=1,COUNTIF($C$3:C39,1),\"\")","v":37},{"$f":"IFERROR(INDEX($F$3:$F$100,MATCH(ROWS($D$3:D39),$D$3:$D$100,0)),\"\")","v":"Holstebro"},"Holstebro"]
[null,null,1,{"$f":"IF(C40=1,COUNTIF($C$3:C40,1),\"\")","v":38},{"$f":"IFERROR(INDEX($F$3:$F$100,MATCH(ROWS($D$3:D40),$D$3:$D$100,0)),\"\")","v":"Horsens"},"Horsens"]
[null,null,1,{"$f":"IF(C41=1,COUNTIF($C$3:C41,1),\"\")","v":39},{"$f":"IFERROR(INDEX($F$3:$F$100,MATCH(ROWS($D$3:D41),$D$3:$D$100,0)),\"\")","v":"Hvidovre"},"Hvidovre"]
[null,null,1,{"$f":"IF(C42=1,COUNTIF($C$3:C42,1),\"\")","v":40},{"$f":"IFERROR(INDEX($F$3:$F$100,MATCH(ROWS($D$3:D42),$D$3:$D$100,0)),\"\")","v":"Høje-Taastrup"},"Høje-Taastrup"]
[null,null,1,{"$f":"IF(C43=1,COUNTIF($C$3:C43,1),\"\")","v":41},{"$f":"IFERROR(INDEX($F$3:$F$100,MATCH(ROWS($D$3:D43),$D$3:$D$100,0)),\"\")","v":"Hørsholm"},"Hørsholm"]
[null,null,1,{"$f":"IF(C44=1,COUNTIF($C$3:C44,1),\"\")","v":42},{"$f":"IFERROR(INDEX($F$3:$F$100,MATCH(ROWS($D$3:D44),$D$3:$D$100,0)),\"\")","v":"Ikast-Brande"},"Ikast-Brande"]
[null,null,1,{"$f":"IF(C45=1,COUNTIF($C$3:C45,1),\"\")","v":43},{"$f":"IFERROR(INDEX($F$3:$F$100,MATCH(ROWS($D$3:D45),$D$3:$D$100,0)),\"\")","v":"Ishøj"},"Ishøj"]
[null,null,1,{"$f":"IF(C46=1,COUNTIF($C$3:C46,1),\"\")","v":44},{"$f":"IFERROR(INDEX($F$3:$F$100,MATCH(ROWS($D$3:D46),$D$3:$D$100,0)),\"\")","v":"Jammerbugt"},"Jammerbugt"]
[null,null,1,{"$f":"IF(C47=1,COUNTIF($C$3:C47,1),\"\")","v":45},{"$f":"IFERROR(INDEX($F$3:$F$100,MATCH(ROWS($D$3:D47),$D$3:$D$100,0)),\"\")","v":"Kalundborg"},"Kalundborg"]
[null,null,1,{"$f":"IF(C48=1,COUNTIF($C$3:C48,1),\"\")","v":46},{"$f":"IFERROR(INDEX($F$3:$F$100,MATCH(ROWS($D$3:D48),$D$3:$D$100,0)),\"\")","v":"Kerteminde"},"Kerteminde"]
[null,null,1,{"$f":"IF(C49=1,COUNTIF($C$3:C49,1),\"\")","v":47},{"$f":"IFERROR(INDEX($F$3:$F$100,MATCH(ROWS($D$3:D49),$D$3:$D$100,0)),\"\")","v":"Kolding"},"Kolding"]
[null,null,1,{"$f":"IF(C50=1,COUNTIF($C$3:C50,1),\"\")","v":48},{"$f":"IFERROR(INDEX($F$3:$F$100,MATCH(ROWS($D$3:D50),$D$3:$D$100,0)),\"\")","v":"København"},"København"]
[null,null,1,{"$f":"IF(C51=1,COUNTIF($C$3:C51,1),\"\")","v":49},{"$f":"IFERROR(INDEX($F$3:$F$100,MATCH(ROWS($D$3:D51),$D$3:$D$100,0)),\"\")","v":"Køge"},"Køge"]
[null,null,1,{"$f":"IF(C52=1,COUNTIF($C$3:C52,1),\"\")","v":50},{"$f":"IFERROR(INDEX($F$3:$F$100,MATCH(ROWS($D$3:D52),$D$3:$D$100,0)),\"\")","v":"Langeland"},"Langeland"]
[null,null,1,{"$f":"IF(C53=1,COUNTIF($C$3:C53,1),\"\")","v":51},{"$f":"IFERROR(INDEX($F$3:$F$100,MATCH(ROWS($D$3:D53),$D$3:$D$100,0)),\"\")","v":"Lejre"},"Lejre"]
[null,null,1,{"$f":"IF(C54=1,COUNTIF($C$3:C54,1),\"\")","v":52},{"$f":"IFERROR(INDEX($F$3:$F$100,MATCH(ROWS($D$3:D54),$D$3:$D$100,0)),\"\")","v":"Lemvig"},"Lemvig"]
[null,null,1,{"$f":"IF(C55=1,COUNTIF($C$3:C55,1),\"\")","v":53},{"$f":"IFERROR(INDEX($F$3:$F$100,MATCH(ROWS($D$3:D55),$D$3:$D$100,0)),\"\")","v":"Lolland"},"Lolland"]
[null,null,1,{"$f":"IF(C56=1,COUNTIF($C$3:C56,1),\"\")","v":54},{"$f":"IFERROR(INDEX($F$3:$F$100,MATCH(ROWS($D$3:D56),$D$3:$D$100,0)),\"\")","v":"Lyngby-Taarbæk"},"Lyngby-Taarbæk"]
[null,null,1,{"$f":"IF(C57=1,COUNTIF($C$3:C57,1),\"\")","v":55},{"$f":"IFERROR(INDEX($F$3:$F$100,MATCH(ROWS($D$3:D57),$D$3:$D$100,0)),\"\")","v":"Læsø"},"Læsø"]
[null,null,1,{"$f":"IF(C58=1,COUNTIF($C$3:C58,1),\"\")","v":56},{"$f":"IFERROR(INDEX($F$3:$F$100,MATCH(ROWS($D$3:D58),$D$3:$D$100,0)),\"\")","v":"Mariagerfjord"},"Mariagerfjord"]
[null,null,1,{"$f":"IF(C59=1,COUNTIF($C$3:C59,1),\"\")","v":57},{"$f":"IFERROR(INDEX($F$3:$F$100,MATCH(ROWS($D$3:D59),$D$3:$D$100,0)),\"\")","v":"Middelfart"},"Middelfart"]
[null,null,1,{"$f":"IF(C60=1,COUNTIF($C$3:C60,1),\"\")","v":58},{"$f":"IFERROR(INDEX($F$3:$F$100,MATCH(ROWS($D$3:D60),$D$3:$D$100,0)),\"\")","v":"Morsø"},"Morsø"]
[null,null,1,{"$f":"IF(C61=1,COUNTIF($C$3:C61,1),\"\")","v":59},{"$f":"IFERROR(INDEX($F$3:$F$100,MATCH(ROWS($D$3:D61),$D$3:$D$100,0)),\"\")","v":"Norddjurs"},"Norddjurs"]
[null,null,1,{"$f":"IF(C62=1,COUNTIF($C$3:C62,1),\"\")","v":60},{"$f":"IFERROR(INDEX($F$3:$F$100,MATCH(ROWS($D$3:D62),$D$3:$D$100,0)),\"\")","v":"Nordfyn"},"Nordfyn"]
[null,null,1,{"$f":"IF(C63=1,COUNTIF($C$3:C63,1),\"\")","v":61},{"$f":"IFERROR(INDEX($F$3:$F$100,MATCH(ROWS($D$3:D63),$D$3:$D$100,0)),\"\")","v":"Nyborg"},"Nyborg"]
[null,null,1,{"$f":"IF(C64=1,COUNTIF($C$3:C64,1),\"\")","v":62},{"$f":"IFERROR(INDEX($F$3:$F$100,MATCH(ROWS($D$3:D64),$D$3:$D$100,0)),\"\")","v":"Næstved"},"Næstved"]
[null,null,1,{"$f":"IF(C65=1,COUNTIF($C$3:C65,1),\"\")","v":63},{"$f":"IFERROR(INDEX($F$3:$F$100,MATCH(ROWS($D$3:D65),$D$3:$D$100,0)),\"\")","v":"Odder"},"Odder"]
[null,null,1,{"$f":"IF(C66=1,COUNTIF($C$3:C66,1),\"\")","v":64},{"$f":"IFERROR(INDEX($F$3:$F$100,MATCH(ROWS($D$3:D66),$D$3:$D$100,0)),\"\")","v":"Odense"},"Odense"]
[null,null,1,{"$f":"IF(C67=1,COUNTIF($C$3:C67,1),\"\")","v":65},{"$f":"IFERROR(INDEX($F$3:$F$100,MATCH(ROWS($D$3:D67),$D$3:$D$100,0)),\"\")","v":"Odsherred"},"Odsherred"]
[null,null,{"$f":"--ISNUMBER(IFERROR(SEARCH($B$3,F68,1),\"\"))","v":1},{"$f":"IF(C68=1,COUNTIF($C$3:C68,1),\"\")","v":66},{"$f":"IFERROR(INDEX($F$3:$F$100,MATCH(ROWS($D$3:D68),$D$3:$D$100,0)),\"\")","v":"Randers"},"Randers"]
[null,null,1,{"$f":"IF(C69=1,COUNTIF($C$3:C69,1),\"\")","v":67},{"$f":"IFERROR(INDEX($F$3:$F$100,MATCH(ROWS($D$3:D69),$D$3:$D$100,0)),\"\")","v":"Rebild"},"Rebild"]
[null,null,1,{"$f":"IF(C70=1,COUNTIF($C$3:C70,1),\"\")","v":68},{"$f":"IFERROR(INDEX($F$3:$F$100,MATCH(ROWS($D$3:D70),$D$3:$D$100,0)),\"\")","v":"Ringkøbing-Skjern"},"Ringkøbing-Skjern"]
[null,null,1,{"$f":"IF(C71=1,COUNTIF($C$3:C71,1),\"\")","v":69},{"$f":"IFERROR(INDEX($F$3:$F$100,MATCH(ROWS($D$3:D71),$D$3:$D$100,0)),\"\")","v":"Ringsted"},"Ringsted"]
[null,null,1,{"$f":"IF(C72=1,COUNTIF($C$3:C72,1),\"\")","v":70},{"$f":"IFERROR(INDEX($F$3:$F$100,MATCH(ROWS($D$3:D72),$D$3:$D$100,0)),\"\")","v":"Roskilde"},"Roskilde"]
[null,null,1,{"$f":"IF(C73=1,COUNTIF($C$3:C73,1),\"\")","v":71},{"$f":"IFERROR(INDEX($F$3:$F$100,MATCH(ROWS($D$3:D73),$D$3:$D$100,0)),\"\")","v":"Rudersdal"},"Rudersdal"]
[null,null,1,{"$f":"IF(C74=1,COUNTIF($C$3:C74,1),\"\")","v":72},{"$f":"IFERROR(INDEX($F$3:$F$100,MATCH(ROWS($D$3:D74),$D$3:$D$100,0)),\"\")","v":"Rødovre"},"Rødovre"]
[null,null,1,{"$f":"IF(C75=1,COUNTIF($C$3:C75,1),\"\")","v":73},{"$f":"IFERROR(INDEX($F$3:$F$100,MATCH(ROWS($D$3:D75),$D$3:$D$100,0)),\"\")","v":"Samsø"},"Samsø"]
[null,null,1,{"$f":"IF(C76=1,COUNTIF($C$3:C76,1),\"\")","v":74},{"$f":"IFERROR(INDEX($F$3:$F$100,MATCH(ROWS($D$3:D76),$D$3:$D$100,0)),\"\")","v":"Silkeborg"},"Silkeborg"]
[null,null,1,{"$f":"IF(C77=1,COUNTIF($C$3:C77,1),\"\")","v":75},{"$f":"IFERROR(INDEX($F$3:$F$100,MATCH(ROWS($D$3:D77),$D$3:$D$100,0)),\"\")","v":"Skanderborg"},"Skanderborg"]
[null,null,1,{"$f":"IF(C78=1,COUNTIF($C$3:C78,1),\"\")","v":76},{"$f":"IFERROR(INDEX($F$3:$F$100,MATCH(ROWS($D$3:D78),$D$3:$D$100,0)),\"\")","v":"Skive"},"Skive"]
[null,null,1,{"$f":"IF(C79=1,COUNTIF($C$3:C79,1),\"\")","v":77},{"$f":"IFERROR(INDEX($F$3:$F$100,MATCH(ROWS($D$3:D79),$D$3:$D$100,0)),\"\")","v":"Slagelse"},"Slagelse"]
[null,null,1,{"$f":"IF(C80=1,COUNTIF($C$3:C80,1),\"\")","v":78},{"$f":"IFERROR(INDEX($F$3:$F$100,MATCH(ROWS($D$3:D80),$D$3:$D$100,0)),\"\")","v":"Solrød"},"Solrød"]
[null,null,1,{"$f":"IF(C81=1,COUNTIF($C$3:C81,1),\"\")","v":79},{"$f":"IFERROR(INDEX($F$3:$F$100,MATCH(ROWS($D$3:D81),$D$3:$D$100,0)),\"\")","v":"Sorø"},"Sorø"]
[null,null,1,{"$f":"IF(C82=1,COUNTIF($C$3:C82,1),\"\")","v":80},{"$f":"IFERROR(INDEX($F$3:$F$100,MATCH(ROWS($D$3:D82),$D$3:$D$100,0)),\"\")","v":"Stevns"},"Stevns"]
[null,null,1,{"$f":"IF(C83=1,COUNTIF($C$3:C83,1),\"\")","v":81},{"$f":"IFERROR(INDEX($F$3:$F$100,MATCH(ROWS($D$3:D83),$D$3:$D$100,0)),\"\")","v":"Struer"},"Struer"]
[null,null,1,{"$f":"IF(C84=1,COUNTIF($C$3:C84,1),\"\")","v":82},{"$f":"IFERROR(INDEX($F$3:$F$100,MATCH(ROWS($D$3:D84),$D$3:$D$100,0)),\"\")","v":"Svendborg"},"Svendborg"]
[null,null,1,{"$f":"IF(C85=1,COUNTIF($C$3:C85,1),\"\")","v":83},{"$f":"IFERROR(INDEX($F$3:$F$100,MATCH(ROWS($D$3:D85),$D$3:$D$100,0)),\"\")","v":"Syddjurs"},"Syddjurs"]
[null,null,1,{"$f":"IF(C86=1,COUNTIF($C$3:C86,1),\"\")","v":84},{"$f":"IFERROR(INDEX($F$3:$F$100,MATCH(ROWS($D$3:D86),$D$3:$D$100,0)),\"\")","v":"Sønderborg"},"Sønderborg"]
[null,null,1,{"$f":"IF(C87=1,COUNTIF($C$3:C87,1),\"\")","v":85},{"$f":"IFERROR(INDEX($F$3:$F$100,MATCH(ROWS($D$3:D87),$D$3:$D$100,0)),\"\")","v":"Thisted"},"Thisted"]
[null,null,1,{"$f":"IF(C88=1,COUNTIF($C$3:C88,1),\"\")","v":86},{"$f":"IFERROR(INDEX($F$3:$F$100,MATCH(ROWS($D$3:D88),$D$3:$D$100,0)),\"\")","v":"Tønder"},"Tønder"]
[null,null,1,{"$f":"IF(C89=1,COUNTIF($C$3:C89,1),\"\")","v":87},{"$f":"IFERROR(INDEX($F$3:$F$100,MATCH(ROWS($D$3:D89),$D$3:$D$100,0)),\"\")","v":"Tårnby"},"Tårnby"]
[null,null,1,{"$f":"IF(C90=1,COUNTIF($C$3:C90,1),\"\")","v":88},{"$f":"IFERROR(INDEX($F$3:$F$100,MATCH(ROWS($D$3:D90),$D$3:$D$100,0)),\"\")","v":"Vallensbæk"},"Vallensbæk"]
[null,null,1,{"$f":"IF(C91=1,COUNTIF($C$3:C91,1),\"\")","v":89},{"$f":"IFERROR(INDEX($F$3:$F$100,MATCH(ROWS($D$3:D91),$D$3:$D$100,0)),\"\")","v":"Varde"},"Varde"]
[null,null,1,{"$f":"IF(C92=1,COUNTIF($C$3:C92,1),\"\")","v":90},{"$f":"IFERROR(INDEX($F$3:$F$100,MATCH(ROWS($D$3:D92),$D$3:$D$100,0)),\"\")","v":"Vejen"},"Vejen"]
[null,null,1,{"$f":"IF(C93=1,COUNTIF($C$3:C93,1),\"\")","v":91},{"$f":"IFERROR(INDEX($F$3:$F$100,MATCH(ROWS($D$3:D93),$D$3:$D$100,0)),\"\")","v":"Vejle"},"Vejle"]
[null,null,1,{"$f":"IF(C94=1,COUNTIF($C$3:C94,1),\"\")","v":92},{"$f":"IFERROR(INDEX($F$3:$F$100,MATCH(ROWS($D$3:D94),$D$3:$D$100,0)),\"\")","v":"Vesthimmerland"},"Vesthimmerland"]
[null,null,1,{"$f":"IF(C95=1,COUNTIF($C$3:C95,1),\"\")","v":93},{"$f":"IFERROR(INDEX($F$3:$F$100,MATCH(ROWS($D$3:D95),$D$3:$D$100,0)),\"\")","v":"Viborg"},"Viborg"]
[null,null,1,{"$f":"IF(C96=1,COUNTIF($C$3:C96,1),\"\")","v":94},{"$f":"IFERROR(INDEX($F$3:$F$100,MATCH(ROWS($D$3:D96),$D$3:$D$100,0)),\"\")","v":"Vordingborg"},"Vordingborg"]
[null,null,1,{"$f":"IF(C97=1,COUNTIF($C$3:C97,1),\"\")","v":95},{"$f":"IFERROR(INDEX($F$3:$F$100,MATCH(ROWS($D$3:D97),$D$3:$D$100,0)),\"\")","v":"Ærø"},"Ærø"]
[null,null,1,{"$f":"IF(C98=1,COUNTIF($C$3:C98,1),\"\")","v":96},{"$f":"IFERROR(INDEX($F$3:$F$100,MATCH(ROWS($D$3:D98),$D$3:$D$100,0)),\"\")","v":"Aabenraa"},"Aabenraa"]
[null,null,1,{"$f":"IF(C99=1,COUNTIF($C$3:C99,1),\"\")","v":97},{"$f":"IFERROR(INDEX($F$3:$F$100,MATCH(ROWS($D$3:D99),$D$3:$D$100,0)),\"\")","v":"Aalborg"},"Aalborg"]
[null,null,1,{"$f":"IF(C100=1,COUNTIF($C$3:C100,1),\"\")","v":98},{"$f":"IFERROR(INDEX($F$3:$F$100,MATCH(ROWS($D$3:D100),$D$3:$D$100,0)),\"\")","v":"Aarhus"},"Aarhus"]

{"sheet":"Ark2","index":1,"n_rows":98,"n_cols":1,"rows_kept":98,"cut":false,"hidden":false,"merged":[]}
["Albertslund"]
["Allerød"]
["Assens"]
["Ballerup"]
["Billund"]
["Bornholm"]
["Brøndby"]
["Brønderslev"]
["Dragør"]
["Egedal"]
["Esbjerg"]
["Fanø"]
["Favrskov"]
["Faxe"]
["Fredensborg"]
["Fredericia"]
["Frederiksberg"]
["Frederikshavn"]
["Frederikssund"]
["Furesø"]
["Faaborg-Midtfyn"]
["Gentofte"]
["Gladsaxe"]
["Glostrup"]
["Greve"]
["Gribskov"]
["Guldborgsund"]
["Haderslev"]
["Halsnæs"]
["Hedensted"]
["Helsingør"]
["Herlev"]
["Herning"]
["Hillerød"]
["Hjørring"]
["Holbæk"]
["Holstebro"]
["Horsens"]
["Hvidovre"]
["Høje-Taastrup"]
["Hørsholm"]
["Ikast-Brande"]
["Ishøj"]
["Jammerbugt"]
["Kalundborg"]
["Kerteminde"]
["Kolding"]
["København"]
["Køge"]
["Langeland"]
["Lejre"]
["Lemvig"]
["Lolland"]
["Lyngby-Taarbæk"]
["Læsø"]
["Mariagerfjord"]
["Middelfart"]
["Morsø"]
["Norddjurs"]
["Nordfyn"]
["Nyborg"]
["Næstved"]
["Odder"]
["Odense"]
["Odsherred"]
["Randers"]
["Rebild"]
["Ringkøbing-Skjern"]
["Ringsted"]
["Roskilde"]
["Rudersdal"]
["Rødovre"]
["Samsø"]
["Silkeborg"]
["Skanderborg"]
["Skive"]
["Slagelse"]
["Solrød"]
["Sorø"]
["Stevns"]
["Struer"]
["Svendborg"]
["Syddjurs"]
["Sønderborg"]
["Thisted"]
["Tønder"]
["Tårnby"]
["Vallensbæk"]
["Varde"]
["Vejen"]
["Vejle"]
["Vesthimmerland"]
["Viborg"]
["Vordingborg"]
["Ærø"]
["Aabenraa"]
["Aalborg"]
["Aarhus"]

{"sheet":"Ark3","index":2,"n_rows":0,"n_cols":0,"rows_kept":0,"cut":false,"hidden":false,"merged":[]}